Target
Melanocortin receptor 5
Ligand
BDBM50121885
Substrate
Meas. Tech.
ChEBML_106812
IC50
13300±n/a nM
Citation
 Cheung, AWDanho, WSwistok, JQi, LKurylko, GRowan, KYeon, MFranco, LChu, XJChen, LYagaloff, K Structure-activity relationship of linear peptide Bu-His-DPhe-Arg-Trp-Gly-NH(2) at the human melanocortin-1 and -4 receptors: histidine substitution. Bioorg Med Chem Lett 13:133-7 (2002)  
Target
Name:
Melanocortin receptor 5
Synonyms:
MC-2 MC5R Melanocortin MC5 Melanocortin receptor 5 | Melanocortin receptor 5 (MC5R)
Type:
Enzyme
Mol. Mass.:
36612.92
Organism:
Homo sapiens (Human)
Description:
P33032
Residue:
325
  
Inhibitor
Name:
BDBM50121885
Synonyms:
(S)-2-{(R)-2-[(S)-2-Butyrylamino-3-(3H-imidazol-4-yl)-propionylamino]-3-phenyl-propionylamino}-5-guanidino-pentanoic acid [(S)-1-(carbamoylmethyl-carbamoyl)-2-(1H-indol-3-yl)-ethyl]-amide CHEMBL29582
Type:
Small organic molecule
Emp. Form.:
C38H50N12O6
Mol. Mass.:
770.8804
SMILES:
CCCC(=O)N[C@@H](Cc1cnc[nH]1)C(=O)N[C@H](Cc1ccccc1)C(=O)N[C@@H](CCCNC(N)=N)C(=O)N[C@@H](Cc1c[nH]c2ccccc12)C(=O)NCC(N)=O
: