Target
Cyclin-dependent kinase 1
Ligand
BDBM50132190
Substrate
Meas. Tech.
ChEBML_52680
IC50
20000±n/a nM
Citation
 Moravec, JKrystof, VHanus, JHavlícek, LMoravcová, DFuksová, KKuzma, MLenobel, ROtyepka, MStrnad, M 2,6,8,9-tetrasubstituted purines as new CDK1 inhibitors. Bioorg Med Chem Lett 13:2993-6 (2003)  
Target
Name:
Cyclin-dependent kinase 1
Synonyms:
CDC2 CDK1 CDKN1 Cell division protein kinase 1 P34CDC2 | p34 protein kinase
Type:
Enzyme Subunit
Mol. Mass.:
34101.08
Organism:
Homo sapiens (Human)
Description:
P06493
Residue:
297
  
Inhibitor
Name:
BDBM50132190
Synonyms:
2-(6-Benzylamino-8-chloro-9-isopropyl-9H-purin-2-ylamino)-butan-1-ol | CHEMBL100079
Type:
Small organic molecule
Emp. Form.:
C19H25ClN6O
Mol. Mass.:
388.894
SMILES:
CCC(CO)Nc1nc(NCc2ccccc2)c2nc(Cl)n(C(C)C)c2n1
: