Target
Cyclin-dependent kinase 1
Ligand
BDBM27216
Substrate
Meas. Tech.
ChEBML_52680
IC50
50±n/a nM
Citation
 Moravec, JKrystof, VHanus, JHavlícek, LMoravcová, DFuksová, KKuzma, MLenobel, ROtyepka, MStrnad, M 2,6,8,9-tetrasubstituted purines as new CDK1 inhibitors. Bioorg Med Chem Lett 13:2993-6 (2003)  
Target
Name:
Cyclin-dependent kinase 1
Synonyms:
CDC2 CDK1 CDKN1 Cell division protein kinase 1 P34CDC2 | p34 protein kinase
Type:
Enzyme Subunit
Mol. Mass.:
34101.08
Organism:
Homo sapiens (Human)
Description:
P06493
Residue:
297
  
Inhibitor
Name:
BDBM27216
Synonyms:
(2R)-2-({6-[(3-chlorophenyl)amino]-9-(propan-2-yl)-9H-purin-2-yl}amino)-3-methylbutan-1-ol CHEMBL23327 | Purvalanol A
Type:
Small organic molecule
Emp. Form.:
C19H25ClN6O
Mol. Mass.:
388.894
SMILES:
CC(C)[C@H](CO)Nc1nc(Nc2cccc(Cl)c2)c2ncn(C(C)C)c2n1
: