Target
C-C chemokine receptor type 5
Ligand
BDBM50124958
Substrate
Meas. Tech.
ChEBML_39654
Ki
2±n/a nM
Citation
 Palani, AShapiro, SClader, JWGreenlee, WJVice, SMcCombie, SCox, KStrizki, JBaroudy, BM Oximino-piperidino-piperidine-based CCR5 antagonists. Part 2: synthesis, SAR and biological evaluation of symmetrical heteroaryl carboxamides. Bioorg Med Chem Lett 13:709-12 (2003)  
Target
Name:
C-C chemokine receptor type 5
Synonyms:
C-C CKR-5 CC-CKR-5 CCR5 CCR5_HUMAN CHEMR13 HIV-1 fusion coreceptor
Type:
Enzyme
Mol. Mass.:
40540.21
Organism:
Homo sapiens (Human)
Description:
P51681
Residue:
352
  
Inhibitor
Name:
BDBM50124958
Synonyms:
(4-{(4-Bromo-phenyl)-[(E)-propoxyimino]-methyl}-4'-methyl-[1,4']bipiperidinyl-1'-yl)-(4,6-dimethyl-pyrimidin-5-yl)-methanone | CHEMBL140390
Type:
Small organic molecule
Emp. Form.:
C28H38BrN5O2
Mol. Mass.:
556.538
SMILES:
CCCO\N=C(/C1CCN(CC1)C1(C)CCN(CC1)C(=O)c1c(C)ncnc1C)c1ccc(Br)cc1
: