Target
Prostaglandin E2 receptor EP4 subtype
Ligand
BDBM50125405
Substrate
Meas. Tech.
ChEMBL_158334 (CHEMBL767817)
Ki
1.2±n/a nM
Citation
 Billot, XChateauneuf, AChauret, NDenis, DGreig, GMathieu, MCMetters, KMSlipetz, DMYoung, RN Discovery of a potent and selective agonist of the prostaglandin EP4 receptor. Bioorg Med Chem Lett 13:1129-32 (2003)  
Target
Name:
Prostaglandin E2 receptor EP4 subtype
Synonyms:
PE2R4_HUMAN PGE2 receptor EP4 subtype PTGER4 Prostanoid EP4 receptor
Type:
Enzyme
Mol. Mass.:
53134.53
Organism:
Homo sapiens (Human)
Description:
P35408
Residue:
488
  
Inhibitor
Name:
BDBM50125405
Synonyms:
(R)-5-((E)-(S)-3-Hydroxy-4-phenyl-but-1-enyl)-1-[6-(1H-tetrazol-5-yl)-hexyl]-pyrrolidin-2-one | CHEMBL275667
Type:
Small organic molecule
Emp. Form.:
C21H29N5O2
Mol. Mass.:
383.4873
SMILES:
O[C@@H](Cc1ccccc1)\C=C\[C@H]1CCC(=O)N1CCCCCCc1nnn[nH]1
: