Target
Vasopressin V1a receptor
Ligand
BDBM50146285
Substrate
Meas. Tech.
ChEMBL_214539 (CHEMBL819376)
Ki
1400±n/a nM
Citation
 Matthews, JMHoekstra, WJDyatkin, ABHecker, LRHlasta, DJPoulter, BLAndrade-Gordon, Pde Garavilla, LDemarest, KTEricson, EGunnet, JWHageman, WLook, RMoore, JBReynolds, CHMaryanoff, BE Potent nonpeptide vasopressin receptor antagonists based on oxazino- and thiazinobenzodiazepine templates. Bioorg Med Chem Lett 14:2747-52 (2004)  
Target
Name:
Vasopressin V1a receptor
Synonyms:
AVPR V1a AVPR1A V1AR_HUMAN VASOPRESSIN V1A Vasopressin V1 receptor Vasopressin receptor
Type:
Receptor
Mol. Mass.:
46820.18
Organism:
Homo sapiens (Human)
Description:
P37288
Residue:
418
  
Inhibitor
Name:
BDBM50146285
Synonyms:
Biphenyl-2-carboxylic acid [4-((S)-3,4,11,11a-tetrahydro-1H,5H-2-thia-4a,10-diaza-dibenzo[a,d]cycloheptene-10-carbonyl)-phenyl]-amide | CHEMBL329903
Type:
Small organic molecule
Emp. Form.:
C32H29N3O2S
Mol. Mass.:
519.657
SMILES:
O=C(Nc1ccc(cc1)C(=O)N1C[C@H]2CSCCN2Cc2ccccc12)c1ccccc1-c1ccccc1
: