Target
Vasopressin V2 receptor
Ligand
BDBM50146297
Substrate
Meas. Tech.
ChEMBL_214261 (CHEMBL818587)
Ki
3.7±n/a nM
Citation
 Matthews, JMHoekstra, WJDyatkin, ABHecker, LRHlasta, DJPoulter, BLAndrade-Gordon, Pde Garavilla, LDemarest, KTEricson, EGunnet, JWHageman, WLook, RMoore, JBReynolds, CHMaryanoff, BE Potent nonpeptide vasopressin receptor antagonists based on oxazino- and thiazinobenzodiazepine templates. Bioorg Med Chem Lett 14:2747-52 (2004)  
Target
Name:
Vasopressin V2 receptor
Synonyms:
ADHR AVPR2 DIR Renal-type arginine vasopressin receptor V2R_HUMAN Vasopressin V2 receptor | Vasopressin receptor
Type:
Receptor
Mol. Mass.:
40295.28
Organism:
Homo sapiens (Human)
Description:
P30518
Residue:
371
  
Inhibitor
Name:
BDBM50146297
Synonyms:
5-Fluoro-biphenyl-2-carboxylic acid [3-chloro-4-(3,4,11,11a-tetrahydro-1H,5H-2-thia-4a,10-diaza-dibenzo[a,d]cycloheptene-10-carbonyl)-phenyl]-amide | CHEMBL330005
Type:
Small organic molecule
Emp. Form.:
C32H27ClFN3O2S
Mol. Mass.:
572.092
SMILES:
Fc1ccc(C(=O)Nc2ccc(C(=O)N3CC4CSCCN4Cc4ccccc34)c(Cl)c2)c(c1)-c1ccccc1
: