Target
Sphingosine 1-phosphate receptor 2
Ligand
BDBM50148407
Substrate
Meas. Tech.
ChEBML_201322
IC50
740±n/a nM
Citation
 Hale, JJDoherty, GToth, LLi, ZMills, SGHajdu, RAnn Keohane, CRosenbach, MMilligan, JShei, GJChrebet, GBergstrom, JCard, DRosen, HMandala, S The discovery of 3-(N-alkyl)aminopropylphosphonic acids as potent S1P receptor agonists. Bioorg Med Chem Lett 14:3495-9 (2004)  
Target
Name:
Sphingosine 1-phosphate receptor 2
Synonyms:
EDG5 S1PR2 Sphingosine 1-phosphate receptor Sphingosine-1-phosphate receptor 2 | ndothelial differentiation G-protein coupled receptor 5
Type:
G Protein-Coupled Receptor (GPCR)
Mol. Mass.:
38883.16
Organism:
Homo sapiens (Human)
Description:
Membranes isolated from S1P2-transfected CHO cells were used in ligand binding assay.
Residue:
353
  
Inhibitor
Name:
BDBM50148407
Synonyms:
(3-Pentadecylamino-propyl)-phosphonic acid | CHEMBL117973
Type:
Small organic molecule
Emp. Form.:
C18H40NO3P
Mol. Mass.:
349.4889
SMILES:
(O)(O)=O
: