Target
Nociceptin receptor
Ligand
BDBM50083230
Substrate
Meas. Tech.
ChEBML_144661
Ki
2.3±n/a nM
Citation
 Chen, ZGoehring, RRValenzano, KJKyle, DJ Design and synthesis of novel small molecule N/OFQ receptor antagonists. Bioorg Med Chem Lett 14:1347-51 (2004)  
Target
Name:
Nociceptin receptor
Synonyms:
KOR-3 Mu-type opioid receptor (Mu) Nociceptin Receptor (ORL1 Receptor) Nociceptin receptor (ORL-1) Nociceptin/Orphanin FQ, NOP receptor OPIATE ORL-1 OPRL1 protein ORL1 Opioid receptor like-1 Orphanin FQ receptor (ORL1) | P41146
Type:
G Protein-Coupled Receptor (GPCR)
Mol. Mass.:
40702.87
Organism:
Homo sapiens (Human)
Description:
P41146
Residue:
370
  
Inhibitor
Name:
BDBM50083230
Synonyms:
1-((3R,4R)-1-Cyclooctylmethyl-3-hydroxymethyl-piperidin-4-yl)-3-ethyl-1,3-dihydro-benzoimidazol-2-one 1-[(3R,4R)-1-cyclooctylmethyl-3-hydroxymethyl-4-piperidyl]-3-ethyl-1,3-dihydro-2H-benzimidazol-2-one J-113397
Type:
Small organic molecule
Emp. Form.:
C24H37N3O2
Mol. Mass.:
399.5695
SMILES:
CCn1c2ccccc2n([C@@H]2CCN(CC3CCCCCCC3)C[C@H]2CO)c1=O
: