Target
Catechol O-methyltransferase
Ligand
BDBM22111
Substrate
Meas. Tech.
ChEBML_47238
Ki
>5400000±n/a nM
Citation
 Anderson, GLBussolotti, DLCoward, JK Synthesis and evaluation of some stable multisubstrate adducts as inhibitors of catechol O-methyltransferase. J Med Chem 24:1271-7 (1982)  
Target
Name:
Catechol O-methyltransferase
Synonyms:
COMT Catechol O-methyltransferase | Catechol O-methyltransferase (MB-COMT)
Type:
Enzyme
Mol. Mass.:
30030.67
Organism:
Homo sapiens (Human)
Description:
P21964
Residue:
271
  
Inhibitor
Name:
BDBM22111
Synonyms:
(2R,3R,4S,5S)-2-(6-amino-9H-purin-9-yl)-5-[(methylsulfanyl)methyl]oxolane-3,4-diol 5'-Methylthioado CHEMBL277041 | MTA
Type:
Nucleoside or nucleotide
Emp. Form.:
C11H15N5O3S
Mol. Mass.:
297.334
SMILES:
CSC[C@H]1O[C@H]([C@H](O)[C@@H]1O)n1cnc2c(N)ncnc12
: