Target
Beta-1/Beta-2/Beta-3 adrenergic receptor
Ligand
BDBM50020240
Substrate
Meas. Tech.
ChEMBL_144838 (CHEMBL752884)
IC50
45±n/a nM
Citation
 Bøgesø, KP Neuroleptic activity and dopamine-uptake inhibition in 1-piperazino-3-phenylindans. J Med Chem 26:935-47 (1983)  
Target
Name:
Beta-1/Beta-2/Beta-3 adrenergic receptor
Synonyms:
Adrenergic receptor beta
Type:
Mol. Mass.:
Description:
ASSAY_ID of ChEMBL is 1340543
Components:
This complex has 3 components.
Component 1
Name:
Beta-1 adrenergic receptor
Synonyms:
ADRB1R, B1AR Adrb1 Adrenergic receptor beta Beta-1 adrenoreceptor adrenergic Beta1,2
Type:
Protein
Mol. Mass.:
50486.84
Organism:
Rattus norvegicus (Rat)
Description:
P18090
Residue:
466
  
Component 2
Name:
Beta-2 adrenergic receptor
Synonyms:
ADRB2_RAT Adrb2r | Adrenergic receptor beta
Type:
PROTEIN
Mol. Mass.:
46896.26
Organism:
Rattus norvegicus
Description:
ChEMBL_38603
Residue:
418
  
Component 3
Name:
Beta-3 adrenergic receptor
Synonyms:
ADRB3_RAT Adrb3r Beta-3 adrenergic receptor
Type:
PROTEIN
Mol. Mass.:
43161.83
Organism:
Rattus norvegicus
Description:
ChEMBL_1509452
Residue:
400
  
Inhibitor
Name:
BDBM50020240
Synonyms:
1-[6-Fluoro-3-(4-fluoro-phenyl)-indan-1-yl]-4-methyl-piperazine CHEMBL307717
Type:
Small organic molecule
Emp. Form.:
C20H22F2N2
Mol. Mass.:
328.3989
SMILES:
CN1CCN(CC1)C1CC(c2ccc(F)cc12)c1ccc(F)cc1
: