Target
Alpha-2A adrenergic receptor [16-465]/Alpha-2B adrenergic receptor/Alpha-2C adrenergic receptor
Ligand
BDBM30712
Substrate
Meas. Tech.
ChEMBL_33912 (CHEMBL645521)
IC50
5±n/a nM
Citation
 Timmermans, PBde Jonge, AThoolen, MJWilffert, BBatink, Hvan Zwieten, PA Quantitative relationships between alpha-adrenergic activity and binding affinity of alpha-adrenoceptor agonists and antagonists. J Med Chem 27:495-503 (1984)  
Target
Name:
Alpha-2A adrenergic receptor [16-465]/Alpha-2B adrenergic receptor/Alpha-2C adrenergic receptor
Synonyms:
Adrenergic receptor alpha-2
Type:
Mol. Mass.:
Description:
ASSAY_ID of ChEMBL is 935397
Components:
This complex has 3 components.
Component 1
Name:
Alpha-2C adrenergic receptor
Synonyms:
ADA2C_RAT Adrenergic receptor alpha adrenergic Alpha2 | adrenergic Alpha2C
Type:
Enzyme Catalytic Domain
Mol. Mass.:
49890.50
Organism:
RAT
Description:
adrenergic Alpha2 0 RAT::P22086
Residue:
458
  
Component 2
Name:
Alpha-2B adrenergic receptor
Synonyms:
ADA2B_RAT Adrenergic receptor alpha Alpha-2B adrenergic receptor Alpha-2B adrenoreceptor | adrenergic Alpha2B
Type:
Enzyme Catalytic Domain
Mol. Mass.:
50379.83
Organism:
NEONATAL RAT
Description:
adrenergic Alpha2B ADRA2B NEONATAL RAT::P19328
Residue:
453
  
Component 3
Name:
Alpha-2A adrenergic receptor [16-465]
Synonyms:
ADA2A_RAT Adrenaline 2 Alpha-2A adrenoceptor Alpha-2AAR Alpha2 Adrenoreceptor adrenergic Alpha2A
Type:
G-protein coupled receptor
Mol. Mass.:
48961.69
Organism:
Rattus norvegicus (rat)
Description:
P22909[16-465]
Residue:
450
  
Inhibitor
Name:
BDBM30712
Synonyms:
6-tert-butyl-3-(2-imidazolin-2-ylmethyl)-2,4-dimethyl-phenol;hydrochloride 6-tert-butyl-3-(4,5-dihydro-1H-imidazol-2-ylmethyl)-2,4-dimethylphenol;hydrochloride Oxymetazoline cid_66259
Type:
Small organic molecule
Emp. Form.:
C16H24N2O
Mol. Mass.:
260.3746
SMILES:
Cc1cc(c(O)c(C)c1CC1=NCCN1)C(C)(C)C
: