Target
D(2) dopamine receptor
Ligand
BDBM50007534
Substrate
Meas. Tech.
ChEMBL_61442 (CHEMBL670668)
IC50
21.0±n/a nM
Citation
 de Paulis, TKumar, YJohansson, LRämsby, SFlorvall, LHall, HAngeby-Möller, KOgren, SO Potential neuroleptic agents. 3. Chemistry and antidopaminergic properties of substituted 6-methoxysalicylamides. J Med Chem 28:1263-9 (1985)  
Target
Name:
D(2) dopamine receptor
Synonyms:
DOPAMINE D2 DOPAMINE D2 Short Dopamine D2 receptor Drd2
Type:
G Protein-Coupled Receptor (GPCR)
Mol. Mass.:
50931.60
Organism:
Rattus norvegicus (rat)
Description:
P61169
Residue:
444
  
Inhibitor
Name:
BDBM50007534
Synonyms:
3-Bromo-N-((S)-1-ethyl-pyrrolidin-2-ylmethyl)-2-hydroxy-6-methoxy-benzamide A 35043 | CHEMBL283099
Type:
Small organic molecule
Emp. Form.:
C15H21BrN2O3
Mol. Mass.:
357.243
SMILES:
CCN1CCC[C@H]1CNC(=O)c1c(O)c(Br)ccc1OC
: