Target
D(2) dopamine receptor
Ligand
BDBM50019439
Substrate
Meas. Tech.
ChEBML_58559
IC50
120±n/a nM
Citation
 New, JSYevich, JPEison, MSTaylor, DPEison, ASRiblet, LAVanderMaelen, CPTemple, DL Buspirone analogues. 2. Structure-activity relationships of aromatic imide derivatives. J Med Chem 29:1476-82 (1986)  
Target
Name:
D(2) dopamine receptor
Synonyms:
DOPAMINE D2 DOPAMINE D2 Short Dopamine D2 receptor Drd2
Type:
G Protein-Coupled Receptor (GPCR)
Mol. Mass.:
50931.60
Organism:
Rattus norvegicus (rat)
Description:
P61169
Residue:
444
  
Inhibitor
Name:
BDBM50019439
Synonyms:
1-[4-(4-Benzo[d]isothiazol-3-yl-piperazin-1-yl)-butyl]-3-(4-fluoro-phenyl)-3-methyl-pyrrolidine-2,5-dione | CHEMBL417685
Type:
Small organic molecule
Emp. Form.:
C26H29FN4O2S
Mol. Mass.:
480.597
SMILES:
CC1(CC(=O)N(CCCCN2CCN(CC2)c2nsc3ccccc23)C1=O)c1ccc(F)cc1
: