Target
Kappa-type opioid receptor
Ligand
BDBM50019839
Substrate
Meas. Tech.
ChEBML_145924
IC50
>10000±n/a nM
Citation
 Marastoni, MSalvadori, SBalboni, GBorea, PAMarzola, GTomatis, R Synthesis and activity profiles of new dermorphin-(1-4) peptide analogues. J Med Chem 30:1538-42 (1987)  
Target
Name:
Kappa-type opioid receptor
Synonyms:
Kappa Opioid Receptor OPRK1 Opiate Kappa 1 | mu/kappa opioid receptor
Type:
G Protein-Coupled Receptor (GPCR)
Mol. Mass.:
42744.99
Organism:
Cavia porcellus (domestic guinea pig)
Description:
P41144
Residue:
380
  
Inhibitor
Name:
BDBM50019839
Synonyms:
(2-{2-[2-Amino-3-(4-hydroxy-phenyl)-propionylamino]-4-methanesulfinyl-butyrylamino}-3-phenyl-propionylamino)-acetic acid methyl ester | CHEMBL2372387
Type:
Small organic molecule
Emp. Form.:
C26H34N4O7S
Mol. Mass.:
546.636
SMILES:
COC(=O)CNC(=O)[C@H](Cc1ccccc1)NC(=O)[C@H](CC[S+](C)[O-])NC(=O)[C@@H](N)Cc1ccc(O)cc1
: