Target
Beta-1/Beta-2/Beta-3 adrenergic receptor
Ligand
BDBM50016913
Substrate
Meas. Tech.
ChEMBL_38886 (CHEMBL652717)
Ki
5000±n/a nM
Citation
 Pierson, MELyon, RATiteler, MSchulman, SBKowalski, PGlennon, RA Design and synthesis of propranolol analogues as serotonergic agents. J Med Chem 32:859-63 (1989)  
Target
Name:
Beta-1/Beta-2/Beta-3 adrenergic receptor
Synonyms:
Adrenergic receptor beta
Type:
Mol. Mass.:
Description:
ASSAY_ID of ChEMBL is 1340543
Components:
This complex has 3 components.
Component 1
Name:
Beta-1 adrenergic receptor
Synonyms:
ADRB1R, B1AR Adrb1 Adrenergic receptor beta Beta-1 adrenoreceptor adrenergic Beta1,2
Type:
Protein
Mol. Mass.:
50486.84
Organism:
Rattus norvegicus (Rat)
Description:
P18090
Residue:
466
  
Component 2
Name:
Beta-2 adrenergic receptor
Synonyms:
ADRB2_RAT Adrb2r | Adrenergic receptor beta
Type:
PROTEIN
Mol. Mass.:
46896.26
Organism:
Rattus norvegicus
Description:
ChEMBL_38603
Residue:
418
  
Component 3
Name:
Beta-3 adrenergic receptor
Synonyms:
ADRB3_RAT Adrb3r Beta-3 adrenergic receptor
Type:
PROTEIN
Mol. Mass.:
43161.83
Organism:
Rattus norvegicus
Description:
ChEMBL_1509452
Residue:
400
  
Inhibitor
Name:
BDBM50016913
Synonyms:
Butyl-ethyl-[2-(naphthalen-1-yloxy)-ethyl]-amine | CHEMBL138907
Type:
Small organic molecule
Emp. Form.:
C18H25NO
Mol. Mass.:
271.3972
SMILES:
CCCCN(CC)CCOc1cccc2ccccc12
: