Target
Angiotensin-converting enzyme
Ligand
BDBM50017122
Substrate
Meas. Tech.
ChEMBL_36012 (CHEMBL644719)
IC50
0.900000±n/a nM
Citation
 Smith, EMSwiss, GFNeustadt, BRMcNamara, PGold, EHSybertz, EJBaum, T Angiotensin converting enzyme inhibitors: spirapril and related compounds. J Med Chem 32:1600-6 (1989)  
Target
Name:
Angiotensin-converting enzyme
Synonyms:
ACE_RAT Angiotensin-converting enzyme | Dcp1
Type:
PROTEIN
Mol. Mass.:
150907.81
Organism:
Rattus norvegicus
Description:
ChEMBL_35219
Residue:
1313
  
Inhibitor
Name:
BDBM50017122
Synonyms:
7-[2-(1-Carboxy-3-phenyl-propylamino)-propionyl]-1,4-dithia-7-aza-spiro[4.4]nonane-8-carboxylic acid CHEMBL579 SPIRAPRILAT
Type:
Small organic molecule
Emp. Form.:
C20H26N2O5S2
Mol. Mass.:
438.561
SMILES:
C[C@H](N[C@@H](CCc1ccccc1)C(O)=O)C(=O)N1CC2(C[C@H]1C(O)=O)SCCS2
: