Target
Aromatase
Ligand
BDBM50014752
Substrate
Meas. Tech.
ChEBML_51212
EC50
76±n/a nM
Citation
 Jones, CDWinter, MAHirsch, KSStamm, NTaylor, HMHolden, HEDavenport, JDKrumkalns, EVSuhr, RG Estrogen synthetase inhibitors. 2. Comparison of the in vitro aromatase inhibitory activity for a variety of nitrogen heterocycles substituted with diarylmethane or diarylmethanol groups. J Med Chem 33:416-29 (1990)  
Target
Name:
Aromatase
Synonyms:
Arom CP19A_RAT Cyp19 Cytochrome P450 19A1 P-450AROM
Type:
PROTEIN
Mol. Mass.:
58418.09
Organism:
Rattus norvegicus
Description:
ChEMBL_51211
Residue:
508
  
Inhibitor
Name:
BDBM50014752
Synonyms:
1-[Bis-(2-chloro-phenyl)-methyl]-1H-imidazole | CHEMBL133145
Type:
Small organic molecule
Emp. Form.:
C16H12Cl2N2
Mol. Mass.:
303.186
SMILES:
Clc1ccccc1C(c1ccccc1Cl)n1ccnc1
: