Target
Aromatase
Ligand
BDBM50014761
Substrate
Meas. Tech.
ChEBML_51212
EC50
2000±n/a nM
Citation
 Jones, CDWinter, MAHirsch, KSStamm, NTaylor, HMHolden, HEDavenport, JDKrumkalns, EVSuhr, RG Estrogen synthetase inhibitors. 2. Comparison of the in vitro aromatase inhibitory activity for a variety of nitrogen heterocycles substituted with diarylmethane or diarylmethanol groups. J Med Chem 33:416-29 (1990)  
Target
Name:
Aromatase
Synonyms:
Arom CP19A_RAT Cyp19 Cytochrome P450 19A1 P-450AROM
Type:
PROTEIN
Mol. Mass.:
58418.09
Organism:
Rattus norvegicus
Description:
ChEMBL_51211
Residue:
508
  
Inhibitor
Name:
BDBM50014761
Synonyms:
Bis-(4-chloro-phenyl)-(2H-[1,2,3]triazol-4-yl)-methanol | CHEMBL137421
Type:
Small organic molecule
Emp. Form.:
C15H11Cl2N3O
Mol. Mass.:
320.173
SMILES:
OC(c1cnn[nH]1)(c1ccc(Cl)cc1)c1ccc(Cl)cc1
: