Target
Beta-1 adrenergic receptor
Ligand
BDBM25762
Substrate
Meas. Tech.
ChEBML_56503
IC50
8900±n/a nM
Citation
 Lis, RMorgan, TKMarisca, AJGomez, RPLind, JMDavey, DDPhillips, GBSullivan, ME Synthesis of novel (aryloxy)propanolamines and related compounds possessing both class II and class III antiarrhythmic activity. J Med Chem 33:2883-91 (1990)  
Target
Name:
Beta-1 adrenergic receptor
Synonyms:
ADRB1 ADRB1_HUMAN Beta-1 adrenoceptor | adrenergic Beta1
Type:
G Protein-Coupled Receptor (GPCR)
Mol. Mass.:
51338.40
Organism:
Homo sapiens (Human)
Description:
P08588
Residue:
477
  
Inhibitor
Name:
BDBM25762
Synonyms:
CHEMBL471 SOTALOL HYDROCHLORIDE Sotalol,(+) cid_66245
Type:
Small organic molecule
Emp. Form.:
C12H20N2O3S
Mol. Mass.:
272.364
SMILES:
CC(C)NCC(O)c1ccc(NS(C)(=O)=O)cc1
: