Target
3-hydroxy-3-methylglutaryl-coenzyme A reductase
Ligand
BDBM50006410
Substrate
Meas. Tech.
ChEBML_80653
IC50
10±n/a nM
Citation
 Roth, BDBocan, TMBlankley, CJChucholowski, AWCreger, PLCreswell, MWFerguson, ENewton, RSO'Brien, PPicard, JA Relationship between tissue selectivity and lipophilicity for inhibitors of HMG-CoA reductase. J Med Chem 34:463-6 (1991)  
Target
Name:
3-hydroxy-3-methylglutaryl-coenzyme A reductase
Synonyms:
HMDH_RAT Hmgcr
Type:
Enzyme
Mol. Mass.:
96689.85
Organism:
Rattus norvegicus (rat)
Description:
Isolated rat liver microsomes were used as enzyme source.
Residue:
887
  
Inhibitor
Name:
BDBM50006410
Synonyms:
CHEMBL2367477 | Sodium; 7-[5-(4-fluoro-phenyl)-3-isopropyl-1-pyridin-2-yl-1H-pyrazol-4-yl]-3,5-dihydroxy-hept-6-enoate
Type:
Small organic molecule
Emp. Form.:
C24H25FN3NaO4
Mol. Mass.:
461.4612
SMILES:
[Na+].CC(C)c1nn(c(c1\C=C\[C@@H](O)C[C@@H](O)CC([O-])=O)-c1ccc(F)cc1)-c1ccccn1
: