Target
Angiotensin-converting enzyme
Ligand
BDBM50011363
Substrate
Meas. Tech.
ChEBML_34788
IC50
1100±n/a nM
Citation
 Pascard, CGuilhem, JVincent, MRémond, GPortevin, BLaubie, M Configuration and preferential solid-state conformations of perindoprilat (S-9780). Comparison with the crystal structures of other ACE inhibitors and conclusions related to structure-activity relationships. J Med Chem 34:663-9 (1991)  
Target
Name:
Angiotensin-converting enzyme
Synonyms:
3.2.1.- ACE Angiotensin-converting enzyme, soluble form DCP1 Kininase II
Type:
Mol. Mass.:
150405.15
Organism:
Oryctolagus cuniculus
Description:
Residue:
1310
  
Inhibitor
Name:
BDBM50011363
Synonyms:
1-[2-(1-Carboxy-butylamino)-propionyl]-octahydro-indole-2-carboxylic acid | CHEMBL349119
Type:
Small organic molecule
Emp. Form.:
C17H28N2O5
Mol. Mass.:
340.4146
SMILES:
CCCC(N[C@H](C)C(=O)N1C2CCCCC2CC1C(O)=O)C(O)=O
: