Target
5-hydroxytryptamine receptor 1A
Ligand
BDBM50007498
Substrate
Meas. Tech.
ChEBML_847
IC50
30±n/a nM
Citation
 Hrib, NJJurcak, JGHuger, FPErrico, CLDunn, RW Synthesis and biological evaluation of a series of substituted N-alkoxyimides and -amides as potential atypical antipsychotic agents. J Med Chem 34:1068-72 (1991)  
Target
Name:
5-hydroxytryptamine receptor 1A
Synonyms:
5-HT-1A 5-HT1A 5-hydroxytryptamine receptor 1A (5HT1A) 5ht1a Htr1a Serotonin 1a (5-HT1a) receptor/Adrenergic receptor alpha-1 | Serotonin receptor 1A
Type:
G Protein-Coupled Receptor (GPCR)
Mol. Mass.:
46445.29
Organism:
Rattus norvegicus (rat)
Description:
Binding assays were performed using rat hippocampal membranes.
Residue:
422
  
Inhibitor
Name:
BDBM50007498
Synonyms:
8-[3-(4-Benzo[d]isothiazol-3-yl-piperazin-1-yl)-propoxy]-8-aza-spiro[4.5]decan-7-one(HCl) | CHEMBL269176
Type:
Small organic molecule
Emp. Form.:
C23H32N4O2S
Mol. Mass.:
428.591
SMILES:
O=C1CC2(CCCC2)CCN1OCCCN1CCN(CC1)c1nsc2ccccc12
: