Target
3-hydroxy-3-methylglutaryl-coenzyme A reductase
Ligand
BDBM50406129
Substrate
Meas. Tech.
ChEBML_80475
IC50
29±n/a nM
Citation
 Bone, EADavidson, AHLewis, CNTodd, RS Synthesis and biological evaluation of dihydroeptastatin, a novel inhibitor of 3-hydroxy-3-methylglutaryl coenzyme A reductase. J Med Chem 35:3388-93 (1992)  
Target
Name:
3-hydroxy-3-methylglutaryl-coenzyme A reductase
Synonyms:
3-hydroxy-3-methylglutaryl-coenzyme A (HMG-CoA) reductase HMDH_HUMAN HMG-CoA reductase (HMGR) | HMGCR
Type:
Enzyme
Mol. Mass.:
97477.10
Organism:
Homo sapiens (Human)
Description:
P04035
Residue:
888
  
Inhibitor
Name:
BDBM50406129
Synonyms:
CHEMBL175236
Type:
Small organic molecule
Emp. Form.:
C24H37O6
Mol. Mass.:
421.5475
SMILES:
CC[C@H](C)C(=O)O[C@H]1C[C@@H](C)C=C2C=C[C@H](C)[C@H](CC[C@@H](O)C[C@@H](O)CC([O-])=O)[C@@H]12
: