Target
Thymidine kinase, cytosolic
Ligand
BDBM1
Substrate
Meas. Tech.
ChEBML_208007
Ki
2000±n/a nM
Citation
 Spadari, SMaga, GFocher, FCiarrocchi, GManservigi, RArcamone, FCapobianco, MCarcuro, AColonna, FIotti, S L-thymidine is phosphorylated by herpes simplex virus type 1 thymidine kinase and inhibits viral growth. J Med Chem 35:4214-20 (1992)  
Target
Name:
Thymidine kinase, cytosolic
Synonyms:
KITH_HUMAN | TK1
Type:
PROTEIN
Mol. Mass.:
25476.50
Organism:
Homo sapiens (Human)
Description:
ChEMBL_1333884
Residue:
234
  
Inhibitor
Name:
BDBM1
Synonyms:
dT | thymidine
Type:
Nucleoside or nucleotide
Emp. Form.:
C10H14N2O5
Mol. Mass.:
242.2286
SMILES:
Cc1cn([C@H]2C[C@H](O)[C@@H](CO)O2)c(=O)[nH]c1=O
: