Target
D(2) dopamine receptor
Ligand
BDBM50005833
Substrate
Meas. Tech.
ChEBML_62245
Ki
>10000±n/a nM
Citation
 Flynn, DLZabrowski, DLBecker, DPNosal, RVillamil, CIGullikson, GWMoummi, CYang, DC SC-53116: the first selective agonist at the newly identified serotonin 5-HT4 receptor subtype. J Med Chem 35:1486-9 (1992)  
Target
Name:
D(2) dopamine receptor
Synonyms:
DOPAMINE D2 DOPAMINE D2 Short Dopamine D2 receptor Drd2
Type:
G Protein-Coupled Receptor (GPCR)
Mol. Mass.:
50931.60
Organism:
Rattus norvegicus (rat)
Description:
P61169
Residue:
444
  
Inhibitor
Name:
BDBM50005833
Synonyms:
(exo)4-Amino-5-chloro-N-(hexahydro-pyrrolizin-1-ylmethyl)-2-methoxy-benzamide 4-Amino-5-chloro-N-(hexahydro-pyrrolizin-2-ylmethyl)-2-methoxy-benzamide 4-amino-5-chloro-N-[(1S-cis-hexahydro-1H-pyrrolizin-1-yl)-methyl]-2-methoxybenzenecarboxamide SC-53116 SC53116
Type:
Small organic molecule
Emp. Form.:
C16H22ClN3O2
Mol. Mass.:
323.818
SMILES:
COc1cc(N)c(Cl)cc1C(=O)NC[C@@H]1CCN2CCC[C@@H]12
: