Target
Muscarinic acetylcholine receptor M2
Ligand
BDBM50004665
Substrate
Meas. Tech.
ChEMBL_98896 (CHEMBL709388)
Ki
160±n/a nM
Citation
 Trybulski, EJZhang, JKramss, RHMangano, RM The synthesis and biochemical pharmacology of enantiomerically pure methylated oxotremorine derivatives. J Med Chem 36:3533-41 (1994)  
Target
Name:
Muscarinic acetylcholine receptor M2
Synonyms:
ACM2_RAT Chrm-2 | Chrm2
Type:
Enzyme Catalytic Domain
Mol. Mass.:
51555.53
Organism:
RAT
Description:
P10980
Residue:
466
  
Inhibitor
Name:
BDBM50004665
Synonyms:
(oxotremorine)1-(4-Pyrrolidin-1-yl-but-2-ynyl)-pyrrolidin-2-one 1-(4-Pyrrolidin-1-yl-but-2-ynyl)-pyrrolidin-2-one (oxotremorphine) 1-[4-(2-oxo-pyrrolidin-1-yl)-but-2-ynyl]-pyrrolidinium Oxotremorine cid_4630
Type:
Small organic molecule
Emp. Form.:
C12H18N2O
Mol. Mass.:
206.2841
SMILES:
O=C1CCCN1CC#CCN1CCCC1
: