Target
Serotonin 2 (5-HT2) receptor
Ligand
BDBM50132693
Substrate
Meas. Tech.
ChEMBL_2389 (CHEMBL617667)
Ki
89±n/a nM
Citation
 Mach, RHLuedtke, RRUnsworth, CDBoundy, VANowak, PAScripko, JGElder, STJackson, JRHoffman, PLEvora, PH 18F-labeled benzamides for studying the dopamine D2 receptor with positron emission tomography. J Med Chem 36:3707-20 (1994)  
Target
Name:
Serotonin 2 (5-HT2) receptor
Synonyms:
5-hydroxytryptamine receptor 2A/2B/2C
Type:
Mol. Mass.:
Description:
ASSAY_ID of ChEMBL is 2197419
Components:
This complex has 3 components.
Component 1
Name:
5-hydroxytryptamine receptor 2B
Synonyms:
5-HT2B 5HT2B_RAT Serotonin 2b (5-HT2b) receptor Srl
Type:
Enzyme Catalytic Domain
Mol. Mass.:
53668.47
Organism:
RAT
Description:
5-HT2B HTR2B RAT::P30994
Residue:
479
  
Component 2
Name:
5-hydroxytryptamine receptor 2C
Synonyms:
5-HT2C 5-hydroxytryptamine receptor 2C (5HT2c) 5ht1c Htr2c Serotonin receptor 2a and 2c (5HT2A and 5HT2C)
Type:
Enzyme
Mol. Mass.:
51935.10
Organism:
Rattus norvegicus (Rat)
Description:
P08909
Residue:
460
  
Component 3
Name:
5-hydroxytryptamine receptor 2A
Synonyms:
5-HT-2A 5-HT2A 5-hydroxytryptamine receptor 2A (5HT2A) Htr2 Serotonin Receptor 2A
Type:
G Protein-Coupled Receptor (GPCR)
Mol. Mass.:
52852.05
Organism:
Rattus norvegicus (rat)
Description:
Rat cortex membranes 5-HT2A receptors.
Residue:
471
  
Inhibitor
Name:
BDBM50132693
Synonyms:
4-Amino-N-(1-benzyl-piperidin-4-yl)-5-chloro-2-methoxy-benzamide 4-amino-N-(1-benzylpiperidin-4-yl)-5-chloro-2-methoxybenzamide Clebopride
Type:
Small organic molecule
Emp. Form.:
C20H24ClN3O2
Mol. Mass.:
373.876
SMILES:
COc1cc(N)c(Cl)cc1C(=O)NC1CCN(Cc2ccccc2)CC1
: