Target
Gastrin/cholecystokinin type B receptor
Ligand
BDBM50456331
Substrate
Meas. Tech.
ChEMBL_48257 (CHEMBL662868)
IC50
0.340000±n/a nM
Citation
 Boden, PRHigginbottom, MHill, DRHorwell, DCHughes, JRees, DCRoberts, ESingh, LSuman-Chauhan, NWoodruff, GN Cholecystokinin dipeptoid antagonists: design, synthesis, and anxiolytic profile of some novel CCK-A and CCK-B selective and"mixed" CCK-A/CCK-B antagonists. J Med Chem 36:552-65 (1993)  
Target
Name:
Gastrin/cholecystokinin type B receptor
Synonyms:
Cckbr Cholecystokinin receptor Gastrin/cholecystokinin type B receptor
Type:
Enzyme Catalytic Domain
Mol. Mass.:
49196.59
Organism:
MOUSE
Description:
Cholecystokinin A CCKBR MOUSE::P56481
Residue:
453
  
Inhibitor
Name:
BDBM50456331
Synonyms:
CHEMBL2111203
Type:
Small organic molecule
Emp. Form.:
C29H39N3O5
Mol. Mass.:
509.6371
SMILES:
O.CC1CCCCC1OC(=O)N[C@](C)(Cc1c[nH]c2ccccc12)C(=O)NC(CO)Cc1ccccc1
: