Target
Mu-type opioid receptor
Ligand
BDBM50039968
Substrate
Meas. Tech.
ChEMBL_138726 (CHEMBL872342)
IC50
5100±n/a nM
Citation
 Weerawarna, SADavis, RDNelson, WL Isothiocyanate-substituted kappa-selective opioid receptor ligands derived from N-methyl-N-[(1S)-1-phenyl-2-(1-pyrrolidinyl)ethyl] phenylacetamide. J Med Chem 37:2856-64 (1994)  
Target
Name:
Mu-type opioid receptor
Synonyms:
M-OR-1 Mu opioid receptor OPIATE Mu OPRM_CAVPO
Type:
Enzyme Catalytic Domain
Mol. Mass.:
11165.58
Organism:
GUINEA PIG
Description:
P97266
Residue:
98
  
Inhibitor
Name:
BDBM50039968
Synonyms:
2-(3-Isothiocyanato-phenyl)-N-methyl-N-((S)-1-phenyl-2-pyrrolidin-1-yl-ethyl)-acetamide | CHEMBL97246
Type:
Small organic molecule
Emp. Form.:
C22H25N3OS
Mol. Mass.:
379.518
SMILES:
CN([C@H](CN1CCCC1)c1ccccc1)C(=O)Cc1cccc(c1)N=C=S
: