Target
Adenosine receptor A3
Ligand
BDBM50407234
Substrate
Meas. Tech.
ChEMBL_30614 (CHEMBL642021)
Ki
2.3±n/a nM
Citation
 Kim, HOJi, XDSiddiqi, SMOlah, MEStiles, GLJacobson, KA 2-Substitution of N6-benzyladenosine-5'-uronamides enhances selectivity for A3 adenosine receptors. J Med Chem 37:3614-21 (1994)  
Target
Name:
Adenosine receptor A3
Synonyms:
AA3R_RAT Adenosine receptor A2a and A3 | Adora3
Type:
PROTEIN
Mol. Mass.:
36643.73
Organism:
Rattus norvegicus
Description:
ChEMBL_479910
Residue:
320
  
Inhibitor
Name:
BDBM50407234
Synonyms:
CHEMBL2113557
Type:
Small organic molecule
Emp. Form.:
C19H21IN6O4S
Mol. Mass.:
556.377
SMILES:
CNC(=O)[C@H]1O[C@H]([C@H](O)[C@@H]1O)n1cnc2c(NCc3cccc(I)c3)nc(SC)nc12
: