Target
5-hydroxytryptamine receptor 2A
Ligand
BDBM50014407
Substrate
Meas. Tech.
ChEMBL_2682 (CHEMBL617930)
Ki
130±n/a nM
Citation
 Anzini, MCappelli, AVomero, SGiorgi, GLanger, THamon, MMerahi, NEmerit, BMCagnotto, ASkorupska, M Novel, potent, and selective 5-HT3 receptor antagonists based on the arylpiperazine skeleton: synthesis, structure, biological activity, and comparative molecular field analysis studies. J Med Chem 38:2692-704 (1995)  
Target
Name:
5-hydroxytryptamine receptor 2A
Synonyms:
5-HT-2A 5-HT2A 5-hydroxytryptamine receptor 2A (5HT2A) Htr2 Serotonin Receptor 2A
Type:
G Protein-Coupled Receptor (GPCR)
Mol. Mass.:
52852.05
Organism:
Rattus norvegicus (rat)
Description:
Rat cortex membranes 5-HT2A receptors.
Residue:
471
  
Inhibitor
Name:
BDBM50014407
Synonyms:
2-(piperazin-1-yl)quinoline 2-Piperazin-1-yl-quinoline (Quipazine) CHEMBL18772 | QUIPAZINE
Type:
Small organic molecule
Emp. Form.:
C13H15N3
Mol. Mass.:
213.2783
SMILES:
C1CN(CCN1)c1ccc2ccccc2n1
: