Target
Kappa-type opioid receptor
Ligand
BDBM50032527
Substrate
Meas. Tech.
ChEMBL_146673 (CHEMBL753165)
Ki
5.5±n/a nM
Citation
 Schmidhammer, HJennewein, HKKrassnig, RTraynor, JRPatel, DBell, KFroschauer, GMattersberger, KJachs-Ewinger, CJura, P Synthesis and biological evaluation of 14-alkoxymorphinans. 11. 3-Hydroxycyprodime and analogues: opioid antagonist profile in comparison to cyprodime. J Med Chem 38:3071-7 (1995)  
Target
Name:
Kappa-type opioid receptor
Synonyms:
Kappa Opioid Receptor OPRK1 Opiate Kappa 1 | mu/kappa opioid receptor
Type:
G Protein-Coupled Receptor (GPCR)
Mol. Mass.:
42744.99
Organism:
Cavia porcellus (domestic guinea pig)
Description:
P41144
Residue:
380
  
Inhibitor
Name:
BDBM50032527
Synonyms:
17-cyclopropylmethyl-10-ethoxy-4-hydroxy-3-methoxy-17-azatetracyclo[7.5.3.01,10.02,7]heptadeca-2(7),3,5-trien-13-one | CHEMBL317269
Type:
Small organic molecule
Emp. Form.:
C23H31NO4
Mol. Mass.:
385.4965
SMILES:
CCO[C@@]12CCC(=O)CC11CCN(CC3CC3)C2Cc2ccc(O)c(OC)c12
: