Target
D(4) dopamine receptor
Ligand
BDBM50026045
Substrate
Meas. Tech.
ChEMBL_60685 (CHEMBL675851)
Ki
3872±n/a nM
Citation
 Thurkauf, AYuan, JChen, XWasley, JWMeade, RWoodruff, KHHuston, KRoss, PC 1-Phenyl-3-(aminomethyl)pyrroles as potential antipsychotic agents. Synthesis and dopamine receptor binding. J Med Chem 38:4950-2 (1996)  
Target
Name:
D(4) dopamine receptor
Synonyms:
D(2C) dopamine receptor DOPAMINE D4.2 DRD4 Dopamine D4 receptor
Type:
Enzyme
Mol. Mass.:
48373.19
Organism:
Homo sapiens (Human)
Description:
P21917
Residue:
419
  
Inhibitor
Name:
BDBM50026045
Synonyms:
(R,S)-3-Bromo-N-(1-ethyl-pyrrolidin-2-ylmethyl)-2,6-dimethoxy-benzamide 3-Bromo-N-((R)-1-ethyl-pyrrolidin-2-ylmethyl)-2,6-dimethoxy-benzamide 3-Bromo-N-(1-ethyl-pyrrolidin-2-ylmethyl)-2,6-dimethoxy-benzamide 3-Bromo-N-(1-ethyl-pyrrolidin-2-ylmethyl)-2,6-dimethoxy-benzamide(remoxipride) REMOXIPRIDE
Type:
Small organic molecule
Emp. Form.:
C16H23BrN2O3
Mol. Mass.:
371.269
SMILES:
CCN1CCC[C@H]1CNC(=O)c1c(OC)ccc(Br)c1OC
: