Target
Thyroid hormone receptor beta
Ligand
BDBM50036399
Substrate
Meas. Tech.
ChEMBL_143915 (CHEMBL752718)
IC50
0.140±n/a nM
Citation
 Yokoyama, NWalker, GNMain, AJStanton, JLMorrissey, MMBoehm, CEngle, ANeubert, ADWasvary, JMStephan, ZF Synthesis and structure-activity relationships of oxamic acid and acetic acid derivatives related to L-thyronine. J Med Chem 38:695-707 (1995)  
Target
Name:
Thyroid hormone receptor beta
Synonyms:
Erba2 THB_RAT Thyroid Hormone Receptor (TR-beta) Thyroid hormone receptor beta-1 | thyroid beta
Type:
Enzyme Catalytic Domain
Mol. Mass.:
52661.52
Organism:
RAT
Description:
thyroid beta 0 RAT::P18113
Residue:
461
  
Inhibitor
Name:
BDBM50036399
Synonyms:
Axitirome N-(4-{3-[(4-Fluoro-phenyl)-hydroxy-methyl]-4-hydroxy-phenoxy}-3,5-dimethyl-phenyl)-oxalamic acid ethyl ester
Type:
Small organic molecule
Emp. Form.:
C25H24FNO6
Mol. Mass.:
453.4596
SMILES:
CCOC(=O)C(=O)Nc1cc(C)c(Oc2ccc(O)c(c2)C(O)c2ccc(F)cc2)c(C)c1
: