Target
Polyunsaturated fatty acid 5-lipoxygenase
Ligand
BDBM50053550
Substrate
Meas. Tech.
ChEMBL_3826 (CHEMBL618012)
IC50
>6000±n/a nM
Citation
 Delorme, DDucharme, YBrideau, CChan, CCChauret, NDesmarais, SDubé, DFalgueyret, JPFortin, RGuay, JHamel, PJones, TRLépine, CLi, CMcAuliffe, MMcFarlane, CSNicoll-Griffith, DARiendeau, DYergey, JAGirard, Y Dioxabicyclooctanyl naphthalenenitriles as nonredox 5-lipoxygenase inhibitors: structure-activity relationship study directed toward the improvement of metabolic stability. J Med Chem 39:3951-70 (1996)  
Target
Name:
Polyunsaturated fatty acid 5-lipoxygenase
Synonyms:
5-LO 5-Lipoxygenase (5-LO) 5-Lipoygenase ALOX5 LOG5 | LOX5_HUMAN
Type:
Enzyme
Mol. Mass.:
77972.74
Organism:
Homo sapiens (Human)
Description:
Recombinant protein was purified from E. coli lysate. After ammonium sulfate precipitation and subsequent steps, the supernatant (S100) was used for 5-LO activity assay.
Residue:
674
  
Inhibitor
Name:
BDBM50053550
Synonyms:
7-[3-(4-Hydroxy-tetrahydro-pyran-4-yl)-benzyloxy]-3,3-dimethyl-4-phenyl-3H-naphtho[2,3-c]furan-1-one | CHEMBL338867
Type:
Small organic molecule
Emp. Form.:
C32H30O5
Mol. Mass.:
494.5776
SMILES:
CC1(C)OC(=O)c2cc3cc(OCc4cccc(c4)C4(O)CCOCC4)ccc3c(c12)-c1ccccc1
: