Target
Polyunsaturated fatty acid 5-lipoxygenase
Ligand
BDBM50053561
Substrate
Meas. Tech.
ChEMBL_3826 (CHEMBL618012)
IC50
380±n/a nM
Citation
 Delorme, DDucharme, YBrideau, CChan, CCChauret, NDesmarais, SDubé, DFalgueyret, JPFortin, RGuay, JHamel, PJones, TRLépine, CLi, CMcAuliffe, MMcFarlane, CSNicoll-Griffith, DARiendeau, DYergey, JAGirard, Y Dioxabicyclooctanyl naphthalenenitriles as nonredox 5-lipoxygenase inhibitors: structure-activity relationship study directed toward the improvement of metabolic stability. J Med Chem 39:3951-70 (1996)  
Target
Name:
Polyunsaturated fatty acid 5-lipoxygenase
Synonyms:
5-LO 5-Lipoxygenase (5-LO) 5-Lipoygenase ALOX5 LOG5 | LOX5_HUMAN
Type:
Enzyme
Mol. Mass.:
77972.74
Organism:
Homo sapiens (Human)
Description:
Recombinant protein was purified from E. coli lysate. After ammonium sulfate precipitation and subsequent steps, the supernatant (S100) was used for 5-LO activity assay.
Residue:
674
  
Inhibitor
Name:
BDBM50053561
Synonyms:
4-(2-Chloro-phenyl)-7-[3-(4-hydroxy-tetrahydro-pyran-4-yl)-benzyloxy]-3H-naphtho[2,3-c]furan-1-one | CHEMBL340333
Type:
Small organic molecule
Emp. Form.:
C30H25ClO5
Mol. Mass.:
500.97
SMILES:
OC1(CCOCC1)c1cccc(COc2ccc3c(c4COC(=O)c4cc3c2)-c2ccccc2Cl)c1
: