Target
D(1A) dopamine receptor
Ligand
BDBM50054084
Substrate
Meas. Tech.
ChEMBL_58656 (CHEMBL670430)
Ki
0.79±n/a nM
Citation
 Claudi, FCingolani, GMDi Stefano, AGiorgioni, GAmenta, FBarili, PFerrari, FGiuliani, D Synthesis, resolution, and preliminary evaluation of trans-2-amino-6(5)-hydroxy-1-phenyl-2,3-dihydro-1H-indenes and related derivatives as dopamine receptors ligands. J Med Chem 39:4238-46 (1996)  
Target
Name:
D(1A) dopamine receptor
Synonyms:
DOPAMINE D1 Dopamine D1 high Dopamine receptor Dopamine1-like Drd1a
Type:
Enzyme Catalytic Domain
Mol. Mass.:
49429.75
Organism:
RAT
Description:
P18901
Residue:
446
  
Inhibitor
Name:
BDBM50054084
Synonyms:
(2R,3R)-2-(Allyl-methyl-amino)-3-phenyl-indan-5-ol | CHEMBL135197
Type:
Small organic molecule
Emp. Form.:
C19H21NO
Mol. Mass.:
279.3761
SMILES:
CN(CC=C)[C@@H]1Cc2ccc(O)cc2[C@H]1c1ccccc1
: