Target
Type-1 angiotensin II receptor
Ligand
BDBM50240609
Substrate
Meas. Tech.
ChEMBL_34659 (CHEMBL649718)
Ki
0.640000±n/a nM
Citation
 Wexler, RRGreenlee, WJIrvin, JDGoldberg, MRPrendergast, KSmith, RDTimmermans, PB Nonpeptide angiotensin II receptor antagonists: the next generation in antihypertensive therapy. J Med Chem 39:625-56 (1996)  
Target
Name:
Type-1 angiotensin II receptor
Synonyms:
AGTR1 ANGIOTENSIN AT1 Angiotensin II type 1a (AT-1a) receptor
Type:
Enzyme Catalytic Domain
Mol. Mass.:
41009.15
Organism:
RABBIT
Description:
ANGIOTENSIN AT1 AGTR1 RABBIT::P34976
Residue:
359
  
Inhibitor
Name:
BDBM50240609
Synonyms:
2-Ethoxy-3-[2'-(1H-tetrazol-5-yl)-biphenyl-4-ylmethyl]-3H-benzoimidazole-4-carboxylic acid(CV-11974) 2-ethoxy-3-[2'-(1H-tetrazol-5-yl)-biphenyl-4-ylmethyl]-3H-benzoimidazole-4-carboxylic acid CHEMBL1016 | CV-11974
Type:
Small organic molecule
Emp. Form.:
C24H20N6O3
Mol. Mass.:
440.454
SMILES:
CCOc1nc2cccc(C(O)=O)c2n1Cc1ccc(cc1)-c1ccccc1-c1nnn[nH]1
: