Target
5-hydroxytryptamine receptor 1D
Ligand
BDBM50056947
Substrate
Meas. Tech.
ChEMBL_1956 (CHEMBL617563)
Ki
6920±n/a nM
Citation
 el Ahmad, YLaurent, EMaillet, PTalab, ATeste, JFDokhan, RTran, GOllivier, R New benzocycloalkylpiperazines, potent and selective 5-HT1A receptor ligands. J Med Chem 40:952-60 (1997)  
Target
Name:
5-hydroxytryptamine receptor 1D
Synonyms:
5HT1D_PIG Serotonin 1d (5-HT1d) receptor
Type:
PROTEIN
Mol. Mass.:
32680.56
Organism:
Sus scrofa
Description:
ChEMBL_1963
Residue:
291
  
Inhibitor
Name:
BDBM50056947
Synonyms:
CHEMBL354210 | N-{2-[4-(1,2,3,4-Tetrahydro-naphthalen-1-yl)-piperazin-1-yl]-ethyl}-benzamide
Type:
Small organic molecule
Emp. Form.:
C23H29N3O
Mol. Mass.:
363.4959
SMILES:
O=C(NCCN1CCN(CC1)C1CCCc2ccccc12)c1ccccc1
: