Target
Mu-type opioid receptor
Ligand
BDBM50067816
Substrate
Meas. Tech.
ChEMBL_148700 (CHEMBL882044)
IC50
5000±n/a nM
Citation
 Efange, SMMash, DCKhare, ABOuyang, Q Modified ibogaine fragments: synthesis and preliminary pharmacological characterization of 3-ethyl-5-phenyl-1,2,3,4,5, 6-hexahydroazepino[4,5-b]benzothiophenes. J Med Chem 41:4486-91 (1998)  
Target
Name:
Mu-type opioid receptor
Synonyms:
MOR-1 Mu-type opioid receptor (MOR) OPRM_RAT Opioid receptor B Ror-b
Type:
G Protein-Coupled Receptor (GPCR)
Mol. Mass.:
44503.11
Organism:
Rattus norvegicus (rat)
Description:
Competition binding assays were carried out using membrane preparations from transfected HN9.10 cells that constitutively expressed the mu opioid receptor.
Residue:
398
  
Inhibitor
Name:
BDBM50067816
Synonyms:
9-(3-Bromo-phenyl)-7-ethyl-6,7,8,9-tetrahydro-5H-10-thia-7-aza-benzo[a]azulene | CHEMBL139081
Type:
Small organic molecule
Emp. Form.:
C20H20BrNS
Mol. Mass.:
386.349
SMILES:
CCN1CCc2c(sc3ccccc23)C(C1)c1cccc(Br)c1
: