Target
5-hydroxytryptamine receptor 1B
Ligand
BDBM10755
Substrate
Meas. Tech.
ChEMBL_1787 (CHEMBL616761)
Ki
1.1±n/a nM
Citation
 Cappelli, AAnzini, MVomero, SMennuni, LMakovec, FDoucet, EHamon, MBruni, GRomeo, MRMenziani, MCDe Benedetti, PGLanger, T Novel potent and selective central 5-HT3 receptor ligands provided with different intrinsic efficacy. 1. Mapping the central 5-HT3 receptor binding site by arylpiperazine derivatives. J Med Chem 41:728-41 (1998)  
Target
Name:
5-hydroxytryptamine receptor 1B
Synonyms:
5-HT-1B 5-hydroxytryptamine receptor 1B (5HT1B) 5ht1b Serotonin 1 (5-HT1) receptor Serotonin receptor 1B
Type:
Protein
Mol. Mass.:
43173.33
Organism:
Rattus norvegicus (Rat)
Description:
P28564
Residue:
386
  
Inhibitor
Name:
BDBM10755
Synonyms:
14C-5-hydroxy tryptamine creatinine disulfate 5-HT 5-hydroxy tryptamine creatinine disulfate Serotonin | [3H]-5-HT
Type:
Small organic molecule
Emp. Form.:
C10H12N2O
Mol. Mass.:
176.2151
SMILES:
NCCc1c[nH]c2ccc(O)cc12
: