Target
B2 bradykinin receptor
Ligand
BDBM50403371
Substrate
Meas. Tech.
ChEMBL_40442 (CHEMBL652381)
Ki
0.077±n/a nM
Citation
 Amblard, MDaffix, IBedos, PBergé, GPruneau, DPaquet, JLLuccarini, JMBélichard, PDodey, PMartinez, J Design and synthesis of potent bradykinin agonists containing a benzothiazepine moiety. J Med Chem 42:4185-92 (1999)  
Target
Name:
B2 bradykinin receptor
Synonyms:
B2 BRADYKININ B2R BKRB2_RAT Bradykinin B2 receptor
Type:
Enzyme Catalytic Domain
Mol. Mass.:
44941.22
Organism:
RAT
Description:
B2 BRADYKININ BDKRB2 RAT::P25023
Residue:
396
  
Inhibitor
Name:
BDBM50403371
Synonyms:
Firazyr ICATIBANT
Type:
Small organic molecule
Emp. Form.:
C59H89N19O13S
Mol. Mass.:
1304.522
SMILES:
[#7]-[#6@H](-[#6]-[#6]-[#6]\[#7]=[#6](\[#7])-[#7])-[#6](=O)-[#7]-[#6@@H](-[#6]-[#6]-[#6]\[#7]=[#6](\[#7])-[#7])-[#6](=O)-[#7]-1-[#6]-[#6]-[#6]-[#6@H]-1-[#6](=O)-[#7]-1-[#6]-[#6@H](-[#8])-[#6]-[#6@H]-1-[#6](=O)-[#7]-[#6]-[#6](=O)-[#7]-[#6@@H](-[#6]-c1cccs1)-[#6](=O)-[#7]-[#6@@H](-[#6]-[#8])-[#6](=O)-[#7]-1-[#6]-c2ccccc2-[#6]-[#6@@H]-1-[#6](=O)-[#7]-1-[#6@H]-2-[#6]-[#6]-[#6]-[#6]-[#6@H]-2-[#6]-[#6@H]-1-[#6](=O)-[#7]-[#6@@H](-[#6]-[#6]-[#6]\[#7]=[#6](\[#7])-[#7])-[#6](-[#8])=O
: