Target
Integrase
Ligand
BDBM50088360
Substrate
Meas. Tech.
ChEMBL_88615 (CHEMBL701719)
IC50
2100±n/a nM
Citation
 Carlson, HAMasukawa, KMRubins, KBushman, FDJorgensen, WLLins, RDBriggs, JMMcCammon, JA Developing a dynamic pharmacophore model for HIV-1 integrase. J Med Chem 43:2100-14 (2000)  
Target
Name:
Integrase
Synonyms:
Human immunodeficiency virus type 1 integrase
Type:
PROTEIN
Mol. Mass.:
32231.48
Organism:
Human immunodeficiency virus 1
Description:
ChEMBL_90865
Residue:
288
  
Inhibitor
Name:
BDBM50088360
Synonyms:
2,3,4,6-tetrahydroxy-5H-benzo[7]annulen-5-one 2,3,4,6-tetrahydroxybenzocyclohepten-5-one Hit compound, 2 purpurogalline
Type:
Small organic molecule
Emp. Form.:
C11H8O5
Mol. Mass.:
220.1782
SMILES:
Oc1cc2cccc(O)c(=O)c2c(O)c1O
: