Target
Adenosine receptor A3
Ligand
BDBM50088421
Substrate
Meas. Tech.
ChEMBL_30609 (CHEMBL642016)
Ki
1.4±n/a nM
Citation
 Jacobson, KAJi, XLi, AHMelman, NSiddiqui, MAShin, KJMarquez, VERavi, RG Methanocarba analogues of purine nucleosides as potent and selective adenosine receptor agonists. J Med Chem 43:2196-203 (2000)  
Target
Name:
Adenosine receptor A3
Synonyms:
AA3R_RAT Adenosine receptor A2a and A3 | Adora3
Type:
PROTEIN
Mol. Mass.:
36643.73
Organism:
Rattus norvegicus
Description:
ChEMBL_479910
Residue:
320
  
Inhibitor
Name:
BDBM50088421
Synonyms:
(2R,3R,4S,5R)-2-[2-Chloro-6-(3-iodo-benzylamino)-purin-9-yl]-5-hydroxymethyl-tetrahydro-furan-3,4-diol CHEMBL307199
Type:
Small organic molecule
Emp. Form.:
C17H17ClIN5O4
Mol. Mass.:
517.705
SMILES:
OC[C@H]1O[C@H]([C@H](O)[C@@H]1O)n1cnc2c(NCc3cccc(I)c3)nc(Cl)nc12
: