Target
Metabotropic glutamate receptor 1
Ligand
BDBM50030630
Substrate
Meas. Tech.
ChEMBL_105708 (CHEMBL719076)
Ki
214000±n/a nM
Citation
 Bräuner-Osborne, HEgebjerg, JNielsen, EOMadsen, UKrogsgaard-Larsen, P Ligands for glutamate receptors: design and therapeutic prospects. J Med Chem 43:2609-45 (2000)  
Target
Name:
Metabotropic glutamate receptor 1
Synonyms:
GPRC1A GRM1_HUMAN Metabotropic Glutamate 1a | metabotropic glutamate 1
Type:
Enzyme
Mol. Mass.:
132358.19
Organism:
Homo sapiens (Human)
Description:
Q13255
Residue:
1194
  
Inhibitor
Name:
BDBM50030630
Synonyms:
(RS)-1-aminoindan-1,5-dicarboxylic acid 1-Amino-indan-1,5-dicarboxylic acid(RS-AIDA) AIDC GNF-Pf-1401
Type:
Small organic molecule
Emp. Form.:
C11H11NO4
Mol. Mass.:
221.2093
SMILES:
NC1(CCc2cc(ccc12)C(O)=O)C(O)=O
: