Target
D(2) dopamine receptor
Ligand
BDBM50007422
Substrate
Meas. Tech.
ChEMBL_62066 (CHEMBL672366)
Kd
40±n/a nM
Citation
 Wilcox, REHuang, WHBrusniak, MYWilcox, DMPearlman, RSTeeter, MMDuRand, CJWiens, BLNeve, KA CoMFA-based prediction of agonist affinities at recombinant wild type versus serine to alanine point mutated D2 dopamine receptors. J Med Chem 43:3005-19 (2000)  
Target
Name:
D(2) dopamine receptor
Synonyms:
DOPAMINE D2 DOPAMINE D2 Short Dopamine D2 receptor Drd2
Type:
G Protein-Coupled Receptor (GPCR)
Mol. Mass.:
50931.60
Organism:
Rattus norvegicus (rat)
Description:
P61169
Residue:
444
  
Inhibitor
Name:
BDBM50007422
Synonyms:
(+)-6-Propyl-5,6,6a,7-tetrahydro-4H-dibenzo[de,g]quinoline-10,11-diol (R) 6-Propyl-5,6,6a,7-tetrahydro-4H-dibenzo[de,g]quinoline-10,11-diol (R)-6-propyl-5,6,6a,7-tetrahydro-4H-dibenzo[de,g]quinoline-10,11-diol 6-Propyl-5,6,6a,7-tetrahydro-4H-dibenzo[de,g]quinoline-10,11-diol CHEMBL538542 N-propylnorapomorphine-(+) | N-propylnorapomorphine-(-)
Type:
Small organic molecule
Emp. Form.:
C19H21NO2
Mol. Mass.:
295.3755
SMILES:
CCCN1CCc2cccc-3c2[C@H]1Cc1ccc(O)c(O)c-31
: