Target
D(2) dopamine receptor
Ligand
BDBM50091033
Substrate
Meas. Tech.
ChEMBL_62063 (CHEMBL670837)
Kd
2.8±n/a nM
Citation
 Wilcox, REHuang, WHBrusniak, MYWilcox, DMPearlman, RSTeeter, MMDuRand, CJWiens, BLNeve, KA CoMFA-based prediction of agonist affinities at recombinant wild type versus serine to alanine point mutated D2 dopamine receptors. J Med Chem 43:3005-19 (2000)  
Target
Name:
D(2) dopamine receptor
Synonyms:
DOPAMINE D2 DOPAMINE D2 Short Dopamine D2 receptor Drd2
Type:
G Protein-Coupled Receptor (GPCR)
Mol. Mass.:
50931.60
Organism:
Rattus norvegicus (rat)
Description:
P61169
Residue:
444
  
Inhibitor
Name:
BDBM50091033
Synonyms:
9-Carbamoyl-7-methyl-4,6,6a,7,8,9-hexahydro-indolo[4,3-fg]quinolin-7-ium(alpha-ergocriptine) | d-Lysergic acid amide
Type:
Small organic molecule
Emp. Form.:
C16H18N3O
Mol. Mass.:
268.3331
SMILES:
C[N@@H+]1C[C@@H](C=C2[C@H]1Cc1c[nH]c3cccc2c13)C(N)=O
: