Target
D(2) dopamine receptor
Ligand
BDBM50056445
Substrate
Meas. Tech.
ChEMBL_62072 (CHEMBL672372)
Kd
0.60±n/a nM
Citation
 Wilcox, REHuang, WHBrusniak, MYWilcox, DMPearlman, RSTeeter, MMDuRand, CJWiens, BLNeve, KA CoMFA-based prediction of agonist affinities at recombinant wild type versus serine to alanine point mutated D2 dopamine receptors. J Med Chem 43:3005-19 (2000)  
Target
Name:
D(2) dopamine receptor
Synonyms:
DOPAMINE D2 DOPAMINE D2 Short Dopamine D2 receptor Drd2
Type:
G Protein-Coupled Receptor (GPCR)
Mol. Mass.:
50931.60
Organism:
Rattus norvegicus (rat)
Description:
P61169
Residue:
444
  
Inhibitor
Name:
BDBM50056445
Synonyms:
1,1-diethyl-3-[(8alpha)-6-methyl-9,10-didehydroergolin-8-yl]urea N'-((8alpha)-9,10-Didehydro-6-methylergolin-8-yl)-N,N-diethylurea lisuride, (S)
Type:
Small organic molecule
Emp. Form.:
C20H26N4O
Mol. Mass.:
338.4466
SMILES:
CCN(CC)C(=O)N[C@@H]1CN(C)[C@@H]2Cc3c[nH]c4cccc(C2=C1)c34
: