Target
Neuraminidase
Ligand
BDBM4706
Substrate
Meas. Tech.
ChEMBL_144590 (CHEMBL882330)
IC50
10000±n/a nM
Citation
 Babu, YSChand, PBantia, SKotian, PDehghani, AEl-Kattan, YLin, THHutchison, TLElliott, AJParker, CDAnanth, SLHorn, LLLaver, GWMontgomery, JA BCX-1812 (RWJ-270201): discovery of a novel, highly potent, orally active, and selective influenza neuraminidase inhibitor through structure-based drug design. J Med Chem 43:3482-6 (2000)  
Target
Name:
Neuraminidase
Synonyms:
Influenza A Virus Neuraminidase NRAM_I34A1 Neuraminidase A
Type:
Enzyme
Mol. Mass.:
50124.14
Organism:
Influenza A virus (A/Puerto Rico/8/34/Mount Sinai(H1N1))
Description:
P03468
Residue:
454
  
Inhibitor
Name:
BDBM4706
Synonyms:
(2R,3R,4S)-3-acetamido-4-hydroxy-2-[(1R,2R)-1,2,3-trihydroxypropyl]-3,4-dihydro-2H-pyran-6-carboxylic acid CHEMBL96712 Neu5Ac2en
Type:
Small organic molecule
Emp. Form.:
C11H17NO8
Mol. Mass.:
291.2546
SMILES:
CC(=O)N[C@@H]1[C@@H](O)C=C(O[C@H]1[C@H](O)[C@H](O)CO)C(O)=O
: